logo
Apache Lounge
Webmasters

 


About

Forum Index Downloads Search Register Log in  RSS Apache Lounge
 



Keep Server Online

If you find the Apache Lounge, the downloads and overall help useful, please express your satisfaction with a donation.

or

Bitcoin

A donation makes a contribution towards the costs, the time and effort that's going in this site and building.

Thank You! Steffen

Apache Lounge is not sponsored.

Your donations will help to keep this site alive and well, and continuing building binaries.



Apache 2.4.27 compilation failed with VC2015

 
Post new topic   Reply to topic    Apache Forum Index -> Apache Building & Member Downloads



View previous topic :: View next topic  
Author Message
Anitha



Joined: 25 Sep 2016
Posts: 11
Location: india

PostPosted: Sun 08 Oct '17 20:44    Post subject: Apache 2.4.27 compilation failed with VC2015 Reply with quote

Hi Team,

Any help will be appreciated. Did i am missing any supporting package for 2.4.27 ?. Could you please help here to fix the issues.

Thanks,
Anitha.S


Last edited by Anitha on Mon 09 Oct '17 23:04; edited 2 times in total
Back to top
Anitha



Joined: 25 Sep 2016
Posts: 11
Location: india

PostPosted: Sun 08 Oct '17 20:49    Post subject: Reply with quote

Facing some more issues....

* fatal error CVT1100: duplicate resource. type:MANIFEST, name:1, language:0x0409
LINK : fatal error LNK1123: failure during conversion to COFF: file invalid or corrupt
* apr-1.lib(apr_atomic.obj) : error LNK2019: unresolved external symbol __InterlockedCompareExchange referenced in function _apr_atomic_cas32@12
apr-1.lib(apr_atomic.obj) : error LNK2019: unresolved external symbol __InterlockedDecrement referenced in function _apr_atomic_dec32@4
apr-1.lib(apr_atomic.obj) : error LNK2019: unresolved external symbol __InterlockedExchange referenced in function _apr_atomic_set32@8
apr-1.lib(apr_atomic.obj) : error LNK2019: unresolved external symbol __InterlockedExchangeAdd referenced in function _apr_atomic_add32@8
apr-1.lib(apr_atomic.obj) : error LNK2019: unresolved external symbol __InterlockedIncrement referenced in function _apr_atomic_inc32@4
.\Release/rotatelogs.exe : fatal error LNK1120: 5 unresolved externals


Please advice Thanks in Advance...

Thanks,
Anitha.S
Back to top
Anitha



Joined: 25 Sep 2016
Posts: 11
Location: india

PostPosted: Mon 09 Oct '17 22:48    Post subject: Re: Apache 2.4.27 compilation failed with VC2015 Reply with quote

Admin note:

Removed post, was duplicate from start post ( bumping).
Back to top
Anitha



Joined: 25 Sep 2016
Posts: 11
Location: india

PostPosted: Tue 10 Oct '17 23:22    Post subject: Apache 2.4.27 compilation failed with VC2015 Reply with quote

Team Please help me. I was unable to proceed further.

Do we need download additional packages? for the bellow error.

mod_lua.h(44): fatal error C1083: Cannot open include file: 'lua.h'

I dint get any clues friends. Help me to proceed further.

Thanks,
Anitha.S
Back to top
James Blond
Moderator


Joined: 19 Jan 2006
Posts: 6255
Location: Germany, Next to Hamburg

PostPosted: Tue 31 Oct '17 17:26    Post subject: Reply with quote

Did you download the source code of lua itself?
Back to top


Post new topic   Reply to topic    Apache Forum Index -> Apache Building & Member Downloads
Page 1 of 1